Reaction Details
TargetCarbonic anhydrase 6
LigandBDBM50131681
Substrate/Competitorn/a
Meas. Tech.ChEMBL_1523555 (CHEMBL3631203)
Ki 560±n/a nM
Citation Maresca, AAkyuz, GOsman, SMAlOthman, ZSupuran, CT Inhibition of mammalian carbonic anhydrase isoforms I-XIV with a series of phenolic acid esters. Bioorg Med Chem23:7181-8 (2015) 
 
Carbonic anhydrase 6
Name:Carbonic anhydrase 6
Type:Enzyme
Mol. Mass.:35371.40
Organism:Homo sapiens (Human)
Description:P23280
Residue:308
BDBM50131681
NameBDBM50131681
Synonyms:CHEMBL3628131
TypeSmall organic molecule
Emp. Form.C25H24O6
Mol. Mass.420.4545
SMILESOc1ccc(CCOc2ccc(CCOC(=O)\C=C\c3ccc(O)c(O)c3)cc2)cc1