Reaction Details
TargetCarbonic anhydrase 7
LigandBDBM50131680
Substrate/Competitorn/a
Meas. Tech.ChEMBL_1523556 (CHEMBL3631204)
Ki 710±n/a nM
Citation Maresca, AAkyuz, GOsman, SMAlOthman, ZSupuran, CT Inhibition of mammalian carbonic anhydrase isoforms I-XIV with a series of phenolic acid esters. Bioorg Med Chem23:7181-8 (2015) 
 
Carbonic anhydrase 7
Name:Carbonic anhydrase 7
Type:Enzyme
Mol. Mass.:29664.11
Organism:Homo sapiens (Human)
Description:Human cloned isozyme.
Residue:264
BDBM50131680
NameBDBM50131680
Synonyms:CHEMBL3628212
TypeSmall organic molecule
Emp. Form.C17H16O4
Mol. Mass.284.3065
SMILESOc1ccc(\C=C\C(=O)OCCc2cccc(O)c2)cc1