Reaction Details
TargetCarbonic anhydrase 12
LigandBDBM50131679
Substrate/Competitorn/a
Meas. Tech.ChEMBL_1523558 (CHEMBL3631206)
Ki 12700±n/a nM
Citation Maresca, AAkyuz, GOsman, SMAlOthman, ZSupuran, CT Inhibition of mammalian carbonic anhydrase isoforms I-XIV with a series of phenolic acid esters. Bioorg Med Chem23:7181-8 (2015) 
 
Carbonic anhydrase 12
Name:Carbonic anhydrase 12
Type:Enzyme
Mol. Mass.:39456.00
Organism:Homo sapiens (Human)
Description:Catalytic domain of human cloned isozyme was used in the assay
Residue:354
BDBM50131679
NameBDBM50131679
Synonyms:CHEMBL3628211 | p-Hydroxyphenylethyl p-coumarate (17)
TypeSmall organic molecule
Emp. Form.C17H16O4
Mol. Mass.284.3065
SMILESOc1ccc(CCOC(=O)\C=C\c2ccc(O)cc2)cc1