Reaction Details
TargetCarbonic anhydrase 13
LigandBDBM4375
Substrate/Competitorn/a
Meas. Tech.ChEMBL_1523559 (CHEMBL3631207)
Ki 10900±n/a nM
Citation Maresca, AAkyuz, GOsman, SMAlOthman, ZSupuran, CT Inhibition of mammalian carbonic anhydrase isoforms I-XIV with a series of phenolic acid esters. Bioorg Med Chem23:7181-8 (2015) 
 
Carbonic anhydrase 13
Name:Carbonic anhydrase 13
Type:Enzyme
Mol. Mass.:29522.80
Organism:Mus musculus (mouse)
Description:Murine cloned isozyme
Residue:262
BDBM4375
NameBDBM4375
Synonyms:(2E)-3-(3,4-dihydroxyphenyl)prop-2-enoic acid 3,4-Dihydroxycinnamate, XVII Caffeic acid cid_689043
TypeSmall organic molecule
Emp. Form.C9H8O4
Mol. Mass.180.1574
SMILESOC(=O)\C=C\c1ccc(O)c(O)c1