Reaction Details
TargetCarbonic anhydrase 14
LigandBDBM50131683
Substrate/Competitorn/a
Meas. Tech.ChEMBL_1523560 (CHEMBL3631208)
Ki 780±n/a nM
Citation Maresca, AAkyuz, GOsman, SMAlOthman, ZSupuran, CT Inhibition of mammalian carbonic anhydrase isoforms I-XIV with a series of phenolic acid esters. Bioorg Med Chem23:7181-8 (2015) 
 
Carbonic anhydrase 14
Name:Carbonic anhydrase 14
Type:Enzyme
Mol. Mass.:37665.67
Organism:Homo sapiens (Human)
Description:Human (cloned) isozyme.
Residue:337
BDBM50131683
NameBDBM50131683
Synonyms:Benzyl (E)-Ferulate | Benzyl Ferulate
TypeSmall organic molecule
Emp. Form.C17H16O4
Mol. Mass.284.3065
SMILESCOc1cc(\C=C\C(=O)OCc2ccccc2)ccc1O