Reaction Details
TargetCarbonic anhydrase 14
LigandBDBM50131679
Substrate/Competitorn/a
Meas. Tech.ChEMBL_1523560 (CHEMBL3631208)
Ki 370±n/a nM
Citation Maresca, AAkyuz, GOsman, SMAlOthman, ZSupuran, CT Inhibition of mammalian carbonic anhydrase isoforms I-XIV with a series of phenolic acid esters. Bioorg Med Chem23:7181-8 (2015) 
 
Carbonic anhydrase 14
Name:Carbonic anhydrase 14
Type:Enzyme
Mol. Mass.:37665.67
Organism:Homo sapiens (Human)
Description:Human (cloned) isozyme.
Residue:337
BDBM50131679
NameBDBM50131679
Synonyms:CHEMBL3628211 | p-Hydroxyphenylethyl p-coumarate (17)
TypeSmall organic molecule
Emp. Form.C17H16O4
Mol. Mass.284.3065
SMILESOc1ccc(CCOC(=O)\C=C\c2ccc(O)cc2)cc1