Reaction Details
TargetCarbonic anhydrase 2
LigandBDBM50131680
Substrate/Competitorn/a
Meas. Tech.ChEMBL_1523550 (CHEMBL3631198)
Ki>50000±n/a nM
Citation Maresca, AAkyuz, GOsman, SMAlOthman, ZSupuran, CT Inhibition of mammalian carbonic anhydrase isoforms I-XIV with a series of phenolic acid esters. Bioorg Med Chem23:7181-8 (2015) 
 
Carbonic anhydrase 2
Name:Carbonic anhydrase 2
Type:Enzyme
Mol. Mass.:29250.71
Organism:Homo sapiens (Human)
Description:P00918
Residue:260
BDBM50131680
NameBDBM50131680
Synonyms:CHEMBL3628212
TypeSmall organic molecule
Emp. Form.C17H16O4
Mol. Mass.284.3065
SMILESOc1ccc(\C=C\C(=O)OCCc2cccc(O)c2)cc1