Reaction Details
TargetCarbonic anhydrase 1
LigandBDBM50131680
Substrate/Competitorn/a
Meas. Tech.ChEMBL_1523549 (CHEMBL3631197)
Ki 3660±n/a nM
Citation Maresca, AAkyuz, GOsman, SMAlOthman, ZSupuran, CT Inhibition of mammalian carbonic anhydrase isoforms I-XIV with a series of phenolic acid esters. Bioorg Med Chem23:7181-8 (2015) 
 
Carbonic anhydrase 1
Name:Carbonic anhydrase 1
Type:Enzyme
Mol. Mass.:28873.37
Organism:Homo sapiens (Human)
Description:P00915
Residue:261
BDBM50131680
NameBDBM50131680
Synonyms:CHEMBL3628212
TypeSmall organic molecule
Emp. Form.C17H16O4
Mol. Mass.284.3065
SMILESOc1ccc(\C=C\C(=O)OCCc2cccc(O)c2)cc1