Reaction Details
TargetCarbonic anhydrase 4
LigandBDBM50259746
Substrate/Competitorn/a
Meas. Tech.ChEMBL_1523552 (CHEMBL3631200)
Ki 44000±n/a nM
Citation Maresca, AAkyuz, GOsman, SMAlOthman, ZSupuran, CT Inhibition of mammalian carbonic anhydrase isoforms I-XIV with a series of phenolic acid esters. Bioorg Med Chem23:7181-8 (2015) 
 
Carbonic anhydrase 4
Name:Carbonic anhydrase 4
Type:Enzyme
Mol. Mass.:35037.98
Organism:Homo sapiens (Human)
Description:P22748
Residue:312
BDBM50259746
NameBDBM50259746
Synonyms:(4-Hydroxyphenyl)ethyl trans-ferulate p-Hydroxyphenethyl trans-ferulate (18) | p-hydroxyphenethyl trans-ferulate
TypeSmall organic molecule
Emp. Form.C18H18O5
Mol. Mass.314.3325
SMILESCOc1cc(\C=C\C(=O)OCCc2ccc(O)cc2)ccc1O