Reaction Details
TargetCarbonic anhydrase 4
LigandBDBM50131680
Substrate/Competitorn/a
Meas. Tech.ChEMBL_1523552 (CHEMBL3631200)
Ki 12500±n/a nM
Citation Maresca, AAkyuz, GOsman, SMAlOthman, ZSupuran, CT Inhibition of mammalian carbonic anhydrase isoforms I-XIV with a series of phenolic acid esters. Bioorg Med Chem23:7181-8 (2015) 
 
Carbonic anhydrase 4
Name:Carbonic anhydrase 4
Type:Enzyme
Mol. Mass.:35037.98
Organism:Homo sapiens (Human)
Description:P22748
Residue:312
BDBM50131680
NameBDBM50131680
Synonyms:CHEMBL3628212
TypeSmall organic molecule
Emp. Form.C17H16O4
Mol. Mass.284.3065
SMILESOc1ccc(\C=C\C(=O)OCCc2cccc(O)c2)cc1