Reaction Details
TargetCarbonic anhydrase 5A, mitochondrial
LigandBDBM50131683
Substrate/Competitorn/a
Meas. Tech.ChEMBL_1523553 (CHEMBL3631201)
Ki 880±n/a nM
Citation Maresca, AAkyuz, GOsman, SMAlOthman, ZSupuran, CT Inhibition of mammalian carbonic anhydrase isoforms I-XIV with a series of phenolic acid esters. Bioorg Med Chem23:7181-8 (2015) 
 
Carbonic anhydrase 5A, mitochondrial
Name:Carbonic anhydrase 5A, mitochondrial
Type:Enzyme
Mol. Mass.:34755.54
Organism:Homo sapiens (Human)
Description:Human (cloned) isozyme
Residue:305
BDBM50131683
NameBDBM50131683
Synonyms:Benzyl (E)-Ferulate | Benzyl Ferulate
TypeSmall organic molecule
Emp. Form.C17H16O4
Mol. Mass.284.3065
SMILESCOc1cc(\C=C\C(=O)OCc2ccccc2)ccc1O