Reaction Details
TargetCarbonic anhydrase 5A, mitochondrial
LigandBDBM50131678
Substrate/Competitorn/a
Meas. Tech.ChEMBL_1523553 (CHEMBL3631201)
Ki 930±n/a nM
Citation Maresca, AAkyuz, GOsman, SMAlOthman, ZSupuran, CT Inhibition of mammalian carbonic anhydrase isoforms I-XIV with a series of phenolic acid esters. Bioorg Med Chem23:7181-8 (2015) 
 
Carbonic anhydrase 5A, mitochondrial
Name:Carbonic anhydrase 5A, mitochondrial
Type:Enzyme
Mol. Mass.:34755.54
Organism:Homo sapiens (Human)
Description:Human (cloned) isozyme
Residue:305
BDBM50131678
NameBDBM50131678
Synonyms:CHEMBL3628210
TypeSmall organic molecule
Emp. Form.C18H18O5
Mol. Mass.314.3325
SMILESCOc1cc(\C=C\C(=O)OCCc2cccc(O)c2)ccc1O