Reaction Details
TargetCarbonic anhydrase 5A, mitochondrial
LigandBDBM50131680
Substrate/Competitorn/a
Meas. Tech.ChEMBL_1523553 (CHEMBL3631201)
Ki 720±n/a nM
Citation Maresca, AAkyuz, GOsman, SMAlOthman, ZSupuran, CT Inhibition of mammalian carbonic anhydrase isoforms I-XIV with a series of phenolic acid esters. Bioorg Med Chem23:7181-8 (2015) 
 
Carbonic anhydrase 5A, mitochondrial
Name:Carbonic anhydrase 5A, mitochondrial
Type:Enzyme
Mol. Mass.:34755.54
Organism:Homo sapiens (Human)
Description:Human (cloned) isozyme
Residue:305
BDBM50131680
NameBDBM50131680
Synonyms:CHEMBL3628212
TypeSmall organic molecule
Emp. Form.C17H16O4
Mol. Mass.284.3065
SMILESOc1ccc(\C=C\C(=O)OCCc2cccc(O)c2)cc1