Reaction Details
TargetKynurenine 3-monooxygenase
LigandBDBM50131813
Substrate/Competitorn/a
Meas. Tech.ChEMBL_1526206 (CHEMBL3636891)
IC50 4.0±n/a nM
Citation Abdel-Magid, AF Kynurenine Monooxygenase (KMO) Inhibitors for the Treatment of Acute Pancreatitis and Neurodegenerative Disorders. ACS Med Chem Lett6:954-5 (2015) 
 
Kynurenine 3-monooxygenase
Name:Kynurenine 3-monooxygenase
Type:PROTEIN
Mol. Mass.:55831.03
Organism:Homo sapiens (Human)
Description:ChEMBL_1487479
Residue:486
BDBM50131813
NameBDBM50131813
Synonyms:CHEMBL3634599
TypeSmall organic molecule
Emp. Form.C17H15ClN2O5
Mol. Mass.362.764
SMILESCC(Oc1cc2oc(=O)n(CCC(O)=O)c2cc1Cl)c1ccccn1