Reaction Details
TargetTyrosine-protein kinase Lck
LigandBDBM50127687
Substrate/Competitorn/a
Meas. Tech.ChEMBL_1526220 (CHEMBL3636905)
IC50 200±n/a nM
Citation Williams, TESubramanian, SVerhagen, JMcBride, CMCostales, ASung, LAntonios-McCrea, WMcKenna, MLouie, AKRamurthy, SLevine, BShafer, CMMachajewski, TRenhowe, PAAppleton, BAAmiri, PChou, JStuart, DAardalen, KPoon, D Discovery of RAF265: A Potent mut-B-RAF Inhibitor for the Treatment of Metastatic Melanoma. ACS Med Chem Lett6:961-5 (2015) 
 
Tyrosine-protein kinase Lck
Name:Tyrosine-protein kinase Lck
Type:n/a
Mol. Mass.:57987.83
Organism:Homo sapiens (Human)
Description:P06239
Residue:509
BDBM50127687
NameBDBM50127687
Synonyms:CHEMBL3632717
TypeSmall organic molecule
Emp. Form.C26H26N6O
Mol. Mass.438.5242
SMILESCn1c(Nc2cccc(c2)C(C)(C)C)nc2cc(Oc3ccnc(c3)-c3ncc[nH]3)ccc12