Reaction Details
TargetPlatelet-derived growth factor receptor beta
LigandBDBM50026679
Substrate/Competitorn/a
Meas. Tech.ChEMBL_1526219 (CHEMBL3636904)
IC50 1.000000±n/a nM
Citation Williams, TESubramanian, SVerhagen, JMcBride, CMCostales, ASung, LAntonios-McCrea, WMcKenna, MLouie, AKRamurthy, SLevine, BShafer, CMMachajewski, TRenhowe, PAAppleton, BAAmiri, PChou, JStuart, DAardalen, KPoon, D Discovery of RAF265: A Potent mut-B-RAF Inhibitor for the Treatment of Metastatic Melanoma. ACS Med Chem Lett6:961-5 (2015) 
 
Platelet-derived growth factor receptor beta
Name:Platelet-derived growth factor receptor beta
Type:Enzyme
Mol. Mass.:123922.25
Organism:Homo sapiens (Human)
Description:P09619
Residue:1106
BDBM50026679
NameBDBM50026679
Synonyms:CHEMBL3335371
TypeSmall organic molecule
Emp. Form.C25H27N5O2
Mol. Mass.429.5142
SMILESCC(=O)Nc1cc(Oc2ccc3n(C)c(Nc4cccc(c4)C(C)(C)C)nc3c2)ccn1