Reaction Details
TargetMast/stem cell growth factor receptor Kit
LigandBDBM26028
Substrate/Competitorn/a
Meas. Tech.ChEMBL_1526218 (CHEMBL3636903)
IC50 10.0±n/a nM
Citation Williams, TESubramanian, SVerhagen, JMcBride, CMCostales, ASung, LAntonios-McCrea, WMcKenna, MLouie, AKRamurthy, SLevine, BShafer, CMMachajewski, TRenhowe, PAAppleton, BAAmiri, PChou, JStuart, DAardalen, KPoon, D Discovery of RAF265: A Potent mut-B-RAF Inhibitor for the Treatment of Metastatic Melanoma. ACS Med Chem Lett6:961-5 (2015) 
 
Mast/stem cell growth factor receptor Kit
Name:Mast/stem cell growth factor receptor Kit
Type:Protein
Mol. Mass.:109869.37
Organism:Homo sapiens (Human)
Description:P10721
Residue:976
BDBM26028
NameBDBM26028
Synonyms:4-({2-[(3-tert-butylphenyl)(methyl)amino]-1H-1,3-benzodiazol-5-yl}oxy)-N-methylpyridine-2-carboxamide | arylaminobenzimidazole, 23
TypeSmall organic molecule
Emp. Form.C25H27N5O2
Mol. Mass.429.5142
SMILESCNC(=O)c1cc(Oc2ccc3n(C)c(Nc4cccc(c4)C(C)(C)C)nc3c2)ccn1