Reaction Details
TargetVascular endothelial growth factor receptor 1/2/3
LigandBDBM50131822
Substrate/Competitorn/a
Meas. Tech.ChEMBL_1526217 (CHEMBL3636902)
IC50 70±n/a nM
Citation Williams, TESubramanian, SVerhagen, JMcBride, CMCostales, ASung, LAntonios-McCrea, WMcKenna, MLouie, AKRamurthy, SLevine, BShafer, CMMachajewski, TRenhowe, PAAppleton, BAAmiri, PChou, JStuart, DAardalen, KPoon, D Discovery of RAF265: A Potent mut-B-RAF Inhibitor for the Treatment of Metastatic Melanoma. ACS Med Chem Lett6:961-5 (2015) 
 
Vascular endothelial growth factor receptor 1/2/3
Name:Vascular endothelial growth factor receptor 1/2/3
Synonyms:Vascular endothelial growth factor receptor
Type:n/a
Mol. Mass.:n/a
Description:ASSAY_ID of ChEMBL is 213950
Components:This complex has 3 components.
Component 1
Name:Vascular endothelial growth factor receptor 2
Type:Receptor Tyrosine Kinase
Mol. Mass.:151510.97
Organism:Homo sapiens (Human)
Description:P35968
Residue:1356
Component 2
Name:Vascular endothelial growth factor receptor 1
Synonyms:FLT FRT Fms-like tyrosine kinase 1 Tyrosine-protein kinase FRT VEGFR-1 VGFR1_HUMAN Vascular endothelial growth factor receptor 1 (FLT1) Vascular endothelial growth factor receptor 1 and 2 (Flt-1 and KDR) Vascular permeability factor receptor vascular endothelial growth factor/vascular permeability factor receptor
Type:Receptor Tyrosine Kinase
Mol. Mass.:150800.23
Organism:Homo sapiens (Human)
Description:P17948
Residue:1338
Component 3
Name:Vascular endothelial growth factor receptor 3
Synonyms:FLT-4 Fms-like tyrosine kinase 4 VEGFR-3 VGFR3_HUMAN Vascular endothelial growth factor receptor 3 (VEGFR-3) | Vascular endothelial growth factor receptor 3 (VEGFR3)
Type:Protein
Mol. Mass.:152749.58
Organism:Homo sapiens (Human)
Description:P35916-2
Residue:1363
BDBM50131822
NameBDBM50131822
Synonyms:CHEMBL3632719
TypeSmall organic molecule
Emp. Form.C27H25F3N6O
Mol. Mass.506.5222
SMILESCn1c(Nc2cccc(c2)C(C)(C)C)nc2cc(Oc3ccnc(c3)-c3ncc([nH]3)C(F)(F)F)ccc12