Reaction Details
TargetCytochrome P450 3A4
LigandBDBM50131831
Substrate/Competitorn/a
Meas. Tech.ChEMBL_1526216 (CHEMBL3636901)
IC50 7100±n/a nM
Citation Williams, TESubramanian, SVerhagen, JMcBride, CMCostales, ASung, LAntonios-McCrea, WMcKenna, MLouie, AKRamurthy, SLevine, BShafer, CMMachajewski, TRenhowe, PAAppleton, BAAmiri, PChou, JStuart, DAardalen, KPoon, D Discovery of RAF265: A Potent mut-B-RAF Inhibitor for the Treatment of Metastatic Melanoma. ACS Med Chem Lett6:961-5 (2015) 
 
Cytochrome P450 3A4
Name:Cytochrome P450 3A4
Type:Enzyme
Mol. Mass.:57349.57
Organism:Homo sapiens (Human)
Description:n/a
Residue:503
BDBM50131831
NameBDBM50131831
Synonyms:CHEMBL3632718
TypeSmall organic molecule
Emp. Form.C32H30N6O
Mol. Mass.514.6202
SMILESCn1c(Nc2cccc(c2)C(C)(C)C)nc2cc(Oc3ccnc(c3)-c3ncc([nH]3)-c3ccccc3)ccc12