Reaction Details
TargetReceptor-type tyrosine-protein phosphatase S
LigandBDBM50131835
Substrate/Competitorn/a
Meas. Tech.ChEMBL_1526440 (CHEMBL3637709)
IC50 7900±n/a nM
Citation Haftchenary, SJouk, AOAubry, ILewis, AMLandry, MBall, DPShouksmith, AECollins, CVTremblay, MLGunning, PT Identification of Bidentate Salicylic Acid Inhibitors of PTP1B. ACS Med Chem Lett6:982-6 (2015) 
 
Receptor-type tyrosine-protein phosphatase S
Name:Receptor-type tyrosine-protein phosphatase S
Type:PROTEIN
Mol. Mass.:217036.26
Organism:Homo sapiens (Human)
Description:ChEMBL_107614
Residue:1948
BDBM50131835
NameBDBM50131835
Synonyms:CHEMBL3632914
TypeSmall organic molecule
Emp. Form.C45H45N7O10S
Mol. Mass.875.945
SMILESOC(=O)c1ccc(NC(=O)CCCn2cc(CN(CC(=O)N(Cc3ccc(cc3)C3CCCCC3)c3ccc(C(O)=O)c(O)c3)S(=O)(=O)c3cccc4cccnc34)nn2)cc1O