Reaction Details
TargetEpidermal growth factor receptor
LigandBDBM50131842
Substrate/Competitorn/a
Meas. Tech.ChEMBL_1526584 (CHEMBL3635803)
IC50 521±n/a nM
Citation Wurz, RPPettus, LHAshton, KBrown, JChen, JJHerberich, BHong, FTHu-Harrington, ENguyen, TSt Jean, DJTadesse, SBauer, DKubryk, MZhan, JCooke, KMitchell, PAndrews, KLHsieh, FHickman, DKalyanaraman, NWu, TReid, DLLobenhofer, EKAndrews, DAEverds, NGuzman, RParsons, ATHedley, SJTedrow, JThiel, ORPotter, MRadinsky, RBeltran, PJTasker, AS Oxopyrido[2,3-d]pyrimidines as Covalent L858R/T790M Mutant Selective Epidermal Growth Factor Receptor (EGFR) Inhibitors. ACS Med Chem Lett6:987-92 (2015) 
 
Epidermal growth factor receptor
Name:Epidermal growth factor receptor
Type:Receptor Kinase Domain
Mol. Mass.:134279.59
Organism:Homo sapiens (Human)
Description:P00533
Residue:1210
BDBM50131842
NameBDBM50131842
Synonyms:CHEMBL3633151
TypeSmall organic molecule
Emp. Form.C29H33N7O3
Mol. Mass.527.6174
SMILESCOc1cc(ccc1Nc1ncc2c(C)cc(=O)n(-c3cccc(NC(=O)C=C)c3)c2n1)N(C)CCN(C)C