Reaction Details
Target5-hydroxytryptamine receptor 7
LigandBDBM50132341
Substrate/Competitorn/a
Meas. Tech.ChEMBL_1527272 (CHEMBL3636151)
Ki>900±n/a nM
Citation Ponnala, SKapadia, NMadapa, SAlberts, ILHarding, WW Synthesis and evaluation of aporphine analogs containing C1 allyl isosteres at the h5-HT(2A) receptor. Bioorg Med Chem Lett25:5102-6 (2015) 
 
5-hydroxytryptamine receptor 7
Name:5-hydroxytryptamine receptor 7
Type:G Protein-Coupled Receptor (GPCR)
Mol. Mass.:53573.08
Organism:Homo sapiens (Human)
Description:P34969
Residue:479
BDBM50132341
NameBDBM50132341
Synonyms:CHEMBL3633757
TypeSmall organic molecule
Emp. Form.C26H24BrNO4
Mol. Mass.494.377
SMILESCOc1cc2CCN(C)C3Cc4cc5OCOc5cc4-c(c1OCc1ccc(Br)cc1)c23