Reaction Details
TargetSigma non-opioid intracellular receptor 1
LigandBDBM50132341
Substrate/Competitorn/a
Meas. Tech.ChEMBL_1527397 (CHEMBL3636772)
Ki<300±n/a nM
Citation Ponnala, SKapadia, NMadapa, SAlberts, ILHarding, WW Synthesis and evaluation of aporphine analogs containing C1 allyl isosteres at the h5-HT(2A) receptor. Bioorg Med Chem Lett25:5102-6 (2015) 
 
Sigma non-opioid intracellular receptor 1
Name:Sigma non-opioid intracellular receptor 1
Type:Enzyme Catalytic Domain
Mol. Mass.:25124.85
Organism:Homo sapiens (Human)
Description:Q99720
Residue:223
BDBM50132341
NameBDBM50132341
Synonyms:CHEMBL3633757
TypeSmall organic molecule
Emp. Form.C26H24BrNO4
Mol. Mass.494.377
SMILESCOc1cc2CCN(C)C3Cc4cc5OCOc5cc4-c(c1OCc1ccc(Br)cc1)c23