Reaction Details
TargetHistone deacetylase 1
LigandBDBM50132484
Substrate/Competitorn/a
Meas. Tech.ChEMBL_1527402 (CHEMBL3636777)
IC50 3.5±n/a nM
Citation Peng, FWWu, TTRen, ZWXue, JYShi, L Hybrids from 4-anilinoquinazoline and hydroxamic acid as dual inhibitors of vascular endothelial growth factor receptor-2 and histone deacetylase. Bioorg Med Chem Lett25:5137-41 (2015) 
 
Histone deacetylase 1
Name:Histone deacetylase 1
Type:Enzyme
Mol. Mass.:55090.27
Organism:Homo sapiens (Human)
Description:Q13547
Residue:482
BDBM50132484
NameBDBM50132484
Synonyms:CHEMBL3633769
TypeSmall organic molecule
Emp. Form.C21H22Cl2N4O4
Mol. Mass.465.33
SMILESCOc1cc2ncnc(Nc3ccc(Cl)cc3Cl)c2cc1OCCCCCC(=O)NO