Reaction Details
TargetMetabotropic glutamate receptor 1
LigandBDBM50132801
Substrate/Competitorn/a
Meas. Tech.ChEMBL_1525064 (CHEMBL3635102)
IC50 20±n/a nM
Citation Garcia-Barrantes, PMCho, HPBlobaum, ALNiswender, CMConn, PJLindsley, CW Lead optimization of the VU0486321 series of mGlu1 PAMs. Part 1: SAR of modifications to the central aryl core. Bioorg Med Chem Lett25:5107-10 (2015) 
 
Metabotropic glutamate receptor 1
Name:Metabotropic glutamate receptor 1
Type:Enzyme
Mol. Mass.:132358.19
Organism:Homo sapiens (Human)
Description:Q13255
Residue:1194
BDBM50132801
NameBDBM50132801
Synonyms:CHEMBL3634441
TypeSmall organic molecule
Emp. Form.C24H16N2O4
Mol. Mass.396.3948
SMILESCc1ccoc1C(=O)Nc1ccc(N2C(=O)c3ccccc3C2=O)c2ccccc12