Reaction Details
TargetPlatelet-activating factor acetylhydrolase
LigandBDBM50132810
Substrate/Competitorn/a
Meas. Tech.ChEMBL_1525084 (CHEMBL3635122)
IC50 11±n/a nM
Citation Chen, XXu, WWang, KMo, MZhang, WDu, LYuan, XXu, YWang, YShen, J Discovery of a Novel Series of Imidazo[1,2-a]pyrimidine Derivatives as Potent and Orally Bioavailable Lipoprotein-Associated Phospholipase A2 Inhibitors. J Med Chem58:8529-41 (2015) 
 
Platelet-activating factor acetylhydrolase
Name:Platelet-activating factor acetylhydrolase
Type:PROTEIN
Mol. Mass.:50084.41
Organism:Homo sapiens (Human)
Description:ChEMBL_156212
Residue:441
BDBM50132810
NameBDBM50132810
Synonyms:CHEMBL3634452
TypeSmall organic molecule
Emp. Form.C25H17ClF3N5O2
Mol. Mass.511.883
SMILESFC(F)(F)c1cc(Oc2ccc(CCOc3ccn4c(cnc4n3)-c3cncnc3)cc2)ccc1Cl