Reaction Details
TargetPlatelet-activating factor acetylhydrolase
LigandBDBM50132818
Substrate/Competitorn/a
Meas. Tech.ChEMBL_1525084 (CHEMBL3635122)
IC50 2.3±n/a nM
Citation Chen, XXu, WWang, KMo, MZhang, WDu, LYuan, XXu, YWang, YShen, J Discovery of a Novel Series of Imidazo[1,2-a]pyrimidine Derivatives as Potent and Orally Bioavailable Lipoprotein-Associated Phospholipase A2 Inhibitors. J Med Chem58:8529-41 (2015) 
 
Platelet-activating factor acetylhydrolase
Name:Platelet-activating factor acetylhydrolase
Type:PROTEIN
Mol. Mass.:50084.41
Organism:Homo sapiens (Human)
Description:ChEMBL_156212
Residue:441
BDBM50132818
NameBDBM50132818
Synonyms:CHEMBL3634553
TypeSmall organic molecule
Emp. Form.C24H13ClF5N5O2
Mol. Mass.533.837
SMILESFc1cc(COc2ccn3c(cnc3n2)-c2cncnc2)cc(F)c1Oc1ccc(Cl)c(c1)C(F)(F)F