Reaction Details
TargetPlatelet-activating factor acetylhydrolase
LigandBDBM50132838
Substrate/Competitorn/a
Meas. Tech.ChEMBL_1525084 (CHEMBL3635122)
IC50 6.3±n/a nM
Citation Chen, XXu, WWang, KMo, MZhang, WDu, LYuan, XXu, YWang, YShen, J Discovery of a Novel Series of Imidazo[1,2-a]pyrimidine Derivatives as Potent and Orally Bioavailable Lipoprotein-Associated Phospholipase A2 Inhibitors. J Med Chem58:8529-41 (2015) 
 
Platelet-activating factor acetylhydrolase
Name:Platelet-activating factor acetylhydrolase
Type:PROTEIN
Mol. Mass.:50084.41
Organism:Homo sapiens (Human)
Description:ChEMBL_156212
Residue:441
BDBM50132838
NameBDBM50132838
Synonyms:CHEMBL3634557
TypeSmall organic molecule
Emp. Form.C23H13Cl2F2N5O2
Mol. Mass.500.284
SMILESFc1cc(COc2ccn3c(cnc3n2)-c2cncnc2)cc(F)c1Oc1ccc(Cl)c(Cl)c1