Reaction Details
Target5-hydroxytryptamine receptor 7
LigandBDBM50133171
Substrate/Competitorn/a
Meas. Tech.ChEMBL_1525282 (CHEMBL3635891)
Ki 19±n/a nM
Citation Huang, LZhang, WZhang, XYin, LChen, BSong, J Synthesis and pharmacological evaluation of piperidine (piperazine)-substituted benzoxazole derivatives as multi-target antipsychotics. Bioorg Med Chem Lett25:5299-305 (2015) 
 
5-hydroxytryptamine receptor 7
Name:5-hydroxytryptamine receptor 7
Type:G Protein-Coupled Receptor (GPCR)
Mol. Mass.:49852.62
Organism:Rattus norvegicus (rat)
Description:Rat cloned 5-HT7R.
Residue:448
BDBM50133171
NameBDBM50133171
Synonyms:CHEMBL3634821
TypeSmall organic molecule
Emp. Form.C29H28FN3O3
Mol. Mass.485.5493
SMILESFc1ccc2c(noc2c1)C1CCN(CCCOc2ccc(Cc3nc4ccccc4o3)cc2)CC1