Reaction Details
TargetMu-type opioid receptor
LigandBDBM50133222
Substrate/Competitorn/a
Meas. Tech.ChEMBL_1525470 (CHEMBL3636668)
Ki 10600±n/a nM
Citation Joshi, AAMurray, TFAldrich, JV Structure-Activity Relationships of the Peptide Kappa Opioid Receptor Antagonist Zyklophin. J Med Chem58:8783-95 (2015) 
 
Mu-type opioid receptor
Name:Mu-type opioid receptor
Type:G Protein-Coupled Receptor (GPCR)
Mol. Mass.:44503.11
Organism:Rattus norvegicus (rat)
Description:Competition binding assays were carried out using membrane preparations from transfected HN9.10 cells that constitutively expressed the mu opioid receptor.
Residue:398
BDBM50133222
NameBDBM50133222
Synonyms:CHEMBL3634922
TypeSmall organic molecule
Emp. Form.C65H95N23O14
Mol. Mass.1422.5955
SMILESNCCCC[C@H](NC(=O)[C@@H]1CCCN1C(=O)[C@H](CCCNC(N)=N)NC(=O)C1CNC(=O)C[C@@H](NC(=O)[C@H](Cc2ccccc2)NC(=O)CNC(=O)CNC(=O)[C@H](Cc2ccc(O)cc2)NC(=O)c2ccccc2)C(=O)N[C@@H](CCCNC(N)=N)C(=O)N[C@@H](CCCNC(N)=N)C(=O)N1)C(N)=O