Reaction Details
TargetMu-type opioid receptor
LigandBDBM50133255
Substrate/Competitorn/a
Meas. Tech.ChEMBL_1525470 (CHEMBL3636668)
Ki>10000±n/a nM
Citation Joshi, AAMurray, TFAldrich, JV Structure-Activity Relationships of the Peptide Kappa Opioid Receptor Antagonist Zyklophin. J Med Chem58:8783-95 (2015) 
 
Mu-type opioid receptor
Name:Mu-type opioid receptor
Type:G Protein-Coupled Receptor (GPCR)
Mol. Mass.:44503.11
Organism:Rattus norvegicus (rat)
Description:Competition binding assays were carried out using membrane preparations from transfected HN9.10 cells that constitutively expressed the mu opioid receptor.
Residue:398
BDBM50133255
NameBDBM50133255
Synonyms:CHEMBL3634926
TypeSmall organic molecule
Emp. Form.C62H90N20O13
Mol. Mass.1323.5042
SMILESC[C@@H]1NC(=O)[C@H](CCCNC(N)=N)NC(=O)[C@@H](CC(=O)NCC(NC1=O)C(=O)N[C@@H](CCCNC(N)=N)C(=O)N1CCC[C@H]1C(=O)N[C@@H](CCCCN)C(N)=O)NC(=O)[C@H](Cc1ccccc1)NC(=O)CNC(=O)CNC(=O)[C@H](Cc1ccc(O)cc1)NCc1ccccc1