Reaction Details
TargetMucosa-associated lymphoid tissue lymphoma translocation protein 1
LigandBDBM50133330
Substrate/Competitorn/a
Meas. Tech.ChEMBL_1525781 (CHEMBL3635350)
IC50 9200±n/a nM
Citation Lim, SMJeong, YLee, SIm, HTae, HSKim, BGPark, HDPark, JHong, S Identification of฿-Lapachone Analogs as Novel MALT1 Inhibitors To Treat an Aggressive Subtype of Diffuse Large B-Cell Lymphoma. J Med Chem58:8491-502 (2015) 
 
Mucosa-associated lymphoid tissue lymphoma translocation protein 1
Name:Mucosa-associated lymphoid tissue lymphoma translocation protein 1
Type:Enzyme
Mol. Mass.:92257.81
Organism:Homo sapiens (Human)
Description:Q9UDY8
Residue:824
BDBM50133330
NameBDBM50133330
Synonyms:CHEMBL3632805
TypeSmall organic molecule
Emp. Form.C15H13BrO3
Mol. Mass.321.166
SMILESCC1(C)CCC2=C(O1)c1ccc(Br)cc1C(=O)C2=O