Reaction Details
TargetMucosa-associated lymphoid tissue lymphoma translocation protein 1
LigandBDBM50133349
Substrate/Competitorn/a
Meas. Tech.ChEMBL_1525779 (CHEMBL3635348)
IC50 2500±n/a nM
Citation Lim, SMJeong, YLee, SIm, HTae, HSKim, BGPark, HDPark, JHong, S Identification of฿-Lapachone Analogs as Novel MALT1 Inhibitors To Treat an Aggressive Subtype of Diffuse Large B-Cell Lymphoma. J Med Chem58:8491-502 (2015) 
 
Mucosa-associated lymphoid tissue lymphoma translocation protein 1
Name:Mucosa-associated lymphoid tissue lymphoma translocation protein 1
Type:Enzyme
Mol. Mass.:92257.81
Organism:Homo sapiens (Human)
Description:Q9UDY8
Residue:824
BDBM50133349
NameBDBM50133349
Synonyms:CHEMBL3634993
TypeSmall organic molecule
Emp. Form.C12H11NO2
Mol. Mass.201.2212
SMILESCN(C)C1=CC(=O)C(=O)c2ccccc12