Reaction Details
TargetCarbonic anhydrase 1
LigandBDBM50133396
Substrate/Competitorn/a
Meas. Tech.ChEMBL_1525818 (CHEMBL3635732)
Ki 1635±n/a nM
Citation La Regina, GColuccia, AFamiglini, VPelliccia, SMonti, LVullo, DNuti, EAlterio, VDe Simone, GMonti, SMPan, PParkkila, SSupuran, CTRossello, ASilvestri, R Discovery of 1,1'-Biphenyl-4-sulfonamides as a New Class of Potent and Selective Carbonic Anhydrase XIV Inhibitors. J Med Chem58:8564-72 (2015) 
 
Carbonic anhydrase 1
Name:Carbonic anhydrase 1
Type:Enzyme
Mol. Mass.:28873.37
Organism:Homo sapiens (Human)
Description:P00915
Residue:261
BDBM50133396
NameBDBM50133396
Synonyms:CHEMBL3632832
TypeSmall organic molecule
Emp. Form.C19H15NO3S
Mol. Mass.337.392
SMILESNS(=O)(=O)c1ccc(cc1)-c1ccc(cc1)C(=O)c1ccccc1