Reaction Details
TargetCarbonic anhydrase 1
LigandBDBM50133402
Substrate/Competitorn/a
Meas. Tech.ChEMBL_1525818 (CHEMBL3635732)
Ki 263±n/a nM
Citation La Regina, GColuccia, AFamiglini, VPelliccia, SMonti, LVullo, DNuti, EAlterio, VDe Simone, GMonti, SMPan, PParkkila, SSupuran, CTRossello, ASilvestri, R Discovery of 1,1'-Biphenyl-4-sulfonamides as a New Class of Potent and Selective Carbonic Anhydrase XIV Inhibitors. J Med Chem58:8564-72 (2015) 
 
Carbonic anhydrase 1
Name:Carbonic anhydrase 1
Type:Enzyme
Mol. Mass.:28873.37
Organism:Homo sapiens (Human)
Description:P00915
Residue:261
BDBM50133402
NameBDBM50133402
Synonyms:CHEMBL3632838
TypeSmall organic molecule
Emp. Form.C20H15NO5S
Mol. Mass.381.402
SMILESNS(=O)(=O)c1ccc(cc1)-c1ccc(cc1)C(=O)c1ccc(cc1)C(O)=O