Reaction Details
TargetCarbonic anhydrase 12
LigandBDBM50133394
Substrate/Competitorn/a
Meas. Tech.ChEMBL_1525821 (CHEMBL3635735)
Ki 7.4±n/a nM
Citation La Regina, GColuccia, AFamiglini, VPelliccia, SMonti, LVullo, DNuti, EAlterio, VDe Simone, GMonti, SMPan, PParkkila, SSupuran, CTRossello, ASilvestri, R Discovery of 1,1'-Biphenyl-4-sulfonamides as a New Class of Potent and Selective Carbonic Anhydrase XIV Inhibitors. J Med Chem58:8564-72 (2015) 
 
Carbonic anhydrase 12
Name:Carbonic anhydrase 12
Type:Enzyme
Mol. Mass.:39456.00
Organism:Homo sapiens (Human)
Description:Catalytic domain of human cloned isozyme was used in the assay
Residue:354
BDBM50133394
NameBDBM50133394
Synonyms:CHEMBL3632830
TypeSmall organic molecule
Emp. Form.C12H10N2O4S
Mol. Mass.278.284
SMILESNS(=O)(=O)c1ccc(cc1)-c1ccc(cc1)[N+]([O-])=O