Reaction Details
TargetCarbonic anhydrase 12
LigandBDBM50133403
Substrate/Competitorn/a
Meas. Tech.ChEMBL_1525821 (CHEMBL3635735)
Ki 94±n/a nM
Citation La Regina, GColuccia, AFamiglini, VPelliccia, SMonti, LVullo, DNuti, EAlterio, VDe Simone, GMonti, SMPan, PParkkila, SSupuran, CTRossello, ASilvestri, R Discovery of 1,1'-Biphenyl-4-sulfonamides as a New Class of Potent and Selective Carbonic Anhydrase XIV Inhibitors. J Med Chem58:8564-72 (2015) 
 
Carbonic anhydrase 12
Name:Carbonic anhydrase 12
Type:Enzyme
Mol. Mass.:39456.00
Organism:Homo sapiens (Human)
Description:Catalytic domain of human cloned isozyme was used in the assay
Residue:354
BDBM50133403
NameBDBM50133403
Synonyms:CHEMBL3632839
TypeSmall organic molecule
Emp. Form.C20H17NO5S
Mol. Mass.383.418
SMILESNS(=O)(=O)c1ccc(cc1)-c1ccc(cc1)C(O)c1ccc(cc1)C(O)=O