Reaction Details
TargetCarbonic anhydrase 14
LigandBDBM50133409
Substrate/Competitorn/a
Meas. Tech.ChEMBL_1525822 (CHEMBL3635736)
Ki 0.670000±n/a nM
Citation La Regina, GColuccia, AFamiglini, VPelliccia, SMonti, LVullo, DNuti, EAlterio, VDe Simone, GMonti, SMPan, PParkkila, SSupuran, CTRossello, ASilvestri, R Discovery of 1,1'-Biphenyl-4-sulfonamides as a New Class of Potent and Selective Carbonic Anhydrase XIV Inhibitors. J Med Chem58:8564-72 (2015) 
 
Carbonic anhydrase 14
Name:Carbonic anhydrase 14
Type:Enzyme
Mol. Mass.:37665.67
Organism:Homo sapiens (Human)
Description:Human (cloned) isozyme.
Residue:337
BDBM50133409
NameBDBM50133409
Synonyms:CHEMBL3632845
TypeSmall organic molecule
Emp. Form.C19H18N2O2S
Mol. Mass.338.423
SMILESNc1ccc(Cc2ccc(cc2)-c2ccc(cc2)S(N)(=O)=O)cc1