Reaction Details
TargetCholinesterase
LigandBDBM8961
Substrate/Competitorn/a
Meas. Tech.ChEMBL_1525952 (CHEMBL3635776)
IC50 80±n/a nM
Citation Nepovimova, EKorabecny, JDolezal, RBabkova, KOndrejicek, AJun, DSepsova, VHorova, AHrabinova, MSoukup, OBukum, NJost, PMuckova, LKassa, JMalinak, DAndrs, MKuca, K Tacrine-Trolox Hybrids: A Novel Class of Centrally Active, Nonhepatotoxic Multi-Target-Directed Ligands Exerting Anticholinesterase and Antioxidant Activities with Low In Vivo Toxicity. J Med Chem58:8985-9003 (2015) 
 
Cholinesterase
Name:Cholinesterase
Type:Homotetramer
Mol. Mass.:68422.27
Organism:Homo sapiens (Human)
Description:P06276
Residue:602
BDBM8961
NameBDBM8961
Synonyms:1,2,3,4-tetrahydro-9-acridinamine 9-THA CHEMBL1337960 Cognex Tracine cid_1935 | tacrine.HCl
TypeSmall organic molecule
Emp. Form.C13H14N2
Mol. Mass.198.2637
SMILESNc1c2CCCCc2nc2ccccc12