Reaction Details
TargetPeptidyl-prolyl cis-trans isomerase NIMA-interacting 1
LigandBDBM50133484
Substrate/Competitorn/a
Meas. Tech.ChEMBL_1525967 (CHEMBL3635791)
IC50 5400±n/a nM
Citation Nakagawa, HSeike, SSugimoto, MIeda, NKawaguchi, MSuzuki, TMiyata, N Peptidyl prolyl isomerase Pin1-inhibitory activity of D-glutamic and D-aspartic acid derivatives bearing a cyclic aliphatic amine moiety. Bioorg Med Chem Lett25:5619-24 (2015) 
 
Peptidyl-prolyl cis-trans isomerase NIMA-interacting 1
Name:Peptidyl-prolyl cis-trans isomerase NIMA-interacting 1
Type:PROTEIN
Mol. Mass.:18248.11
Organism:Homo sapiens (Human)
Description:ChEMBL_1502595
Residue:163
BDBM50133484
NameBDBM50133484
Synonyms:CHEMBL3633022
TypeSmall organic molecule
Emp. Form.C19H21N3O5S
Mol. Mass.403.452
SMILESOC(=O)[C@@H](CCC(=O)N1CCOCC1)NC(=O)c1csc(n1)-c1ccccc1