Reaction Details
TargetG-protein coupled receptor family C group 6 member A
LigandBDBM50133676
Substrate/Competitorn/a
Meas. Tech.ChEMBL_1526359 (CHEMBL3637420)
IC50 21878±n/a nM
Citation Johansson, HBoesgaard, MWNørskov-Lauritsen, LLarsen, IKuhne, SGloriam, DEBräuner-Osborne, HSejer Pedersen, D Selective Allosteric Antagonists for the G Protein-Coupled Receptor GPRC6A Based on the 2-Phenylindole Privileged Structure Scaffold. J Med Chem58:8938-51 (2015) 
 
G-protein coupled receptor family C group 6 member A
Name:G-protein coupled receptor family C group 6 member A
Type:PROTEIN
Mol. Mass.:104230.70
Organism:Mus musculus
Description:ChEMBL_109502
Residue:928
BDBM50133676
NameBDBM50133676
Synonyms:CHEMBL3633650
TypeSmall organic molecule
Emp. Form.C23H25N3O3
Mol. Mass.391.4629
SMILESCN(CC(=O)N1CCOCC1)CC(=O)c1c([nH]c2ccccc12)-c1ccccc1