Reaction Details
Target5-hydroxytryptamine receptor 2C
LigandBDBM50133685
Substrate/Competitorn/a
Meas. Tech.ChEMBL_1526361 (CHEMBL3637422)
IC50 209000±n/a nM
Citation Johansson, HBoesgaard, MWNørskov-Lauritsen, LLarsen, IKuhne, SGloriam, DEBräuner-Osborne, HSejer Pedersen, D Selective Allosteric Antagonists for the G Protein-Coupled Receptor GPRC6A Based on the 2-Phenylindole Privileged Structure Scaffold. J Med Chem58:8938-51 (2015) 
 
5-hydroxytryptamine receptor 2C
Name:5-hydroxytryptamine receptor 2C
Type:G Protein-Coupled Receptor (GPCR)
Mol. Mass.:51836.79
Organism:Homo sapiens (Human)
Description:P28335
Residue:458
BDBM50133685
NameBDBM50133685
Synonyms:CHEMBL3633663
TypeSmall organic molecule
Emp. Form.C26H29N3O3
Mol. Mass.431.5268
SMILESO=C(CN1CCCC(C1)C(=O)N1CCOCC1)c1c([nH]c2ccccc12)-c1ccccc1