Reaction Details
TargetMetabotropic glutamate receptor 5
LigandBDBM50133685
Substrate/Competitorn/a
Meas. Tech.ChEMBL_1526364 (CHEMBL3637425)
IC50 263000±n/a nM
Citation Johansson, HBoesgaard, MWNørskov-Lauritsen, LLarsen, IKuhne, SGloriam, DEBräuner-Osborne, HSejer Pedersen, D Selective Allosteric Antagonists for the G Protein-Coupled Receptor GPRC6A Based on the 2-Phenylindole Privileged Structure Scaffold. J Med Chem58:8938-51 (2015) 
 
Metabotropic glutamate receptor 5
Name:Metabotropic glutamate receptor 5
Type:Enzyme
Mol. Mass.:131900.14
Organism:Rattus norvegicus (Rat)
Description:P31424
Residue:1203
BDBM50133685
NameBDBM50133685
Synonyms:CHEMBL3633663
TypeSmall organic molecule
Emp. Form.C26H29N3O3
Mol. Mass.431.5268
SMILESO=C(CN1CCCC(C1)C(=O)N1CCOCC1)c1c([nH]c2ccccc12)-c1ccccc1