Reaction Details
TargetCarbonic anhydrase 1
LigandBDBM50133807
Substrate/Competitorn/a
Meas. Tech.ChEMBL_1526373 (CHEMBL3637534)
Ki 208±n/a nM
Citation Isik, SVullo, DDurdagi, SEkinci, DSentürk, MÇetin, ASentürk, ESupuran, CT Interaction of carbonic anhydrase isozymes I, II, and IX with some pyridine and phenol hydrazinecarbothioamide derivatives. Bioorg Med Chem Lett25:5636-41 (2015) 
 
Carbonic anhydrase 1
Name:Carbonic anhydrase 1
Type:Enzyme
Mol. Mass.:28873.37
Organism:Homo sapiens (Human)
Description:P00915
Residue:261
BDBM50133807
NameBDBM50133807
Synonyms:CHEMBL3633779
TypeSmall organic molecule
Emp. Form.C10H13N3O2S
Mol. Mass.239.294
SMILESCCNC(=S)NNC(=O)c1ccccc1O