Reaction Details
TargetCarbonic anhydrase 1
LigandBDBM50133861
Substrate/Competitorn/a
Meas. Tech.ChEMBL_1526373 (CHEMBL3637534)
Ki 871±n/a nM
Citation Isik, SVullo, DDurdagi, SEkinci, DSentürk, MÇetin, ASentürk, ESupuran, CT Interaction of carbonic anhydrase isozymes I, II, and IX with some pyridine and phenol hydrazinecarbothioamide derivatives. Bioorg Med Chem Lett25:5636-41 (2015) 
 
Carbonic anhydrase 1
Name:Carbonic anhydrase 1
Type:Enzyme
Mol. Mass.:28873.37
Organism:Homo sapiens (Human)
Description:P00915
Residue:261
BDBM50133861
NameBDBM50133861
Synonyms:CHEMBL1479002
TypeSmall organic molecule
Emp. Form.C10H12N4OS
Mol. Mass.236.293
SMILESC=CCNC(=S)NNC(=O)c1ccncc1