Reaction Details
TargetCarbonic anhydrase 1
LigandBDBM50133863
Substrate/Competitorn/a
Meas. Tech.ChEMBL_1526373 (CHEMBL3637534)
Ki 47±n/a nM
Citation Isik, SVullo, DDurdagi, SEkinci, DSentürk, MÇetin, ASentürk, ESupuran, CT Interaction of carbonic anhydrase isozymes I, II, and IX with some pyridine and phenol hydrazinecarbothioamide derivatives. Bioorg Med Chem Lett25:5636-41 (2015) 
 
Carbonic anhydrase 1
Name:Carbonic anhydrase 1
Type:Enzyme
Mol. Mass.:28873.37
Organism:Homo sapiens (Human)
Description:P00915
Residue:261
BDBM50133863
NameBDBM50133863
Synonyms:CHEMBL3127420
TypeSmall organic molecule
Emp. Form.C14H14N4OS
Mol. Mass.286.352
SMILESCc1ccc(NC(=S)NNC(=O)c2ccncc2)cc1