Reaction Details
TargetCarbonic anhydrase 1
LigandBDBM50133787
Substrate/Competitorn/a
Meas. Tech.ChEMBL_1526373 (CHEMBL3637534)
Ki 97±n/a nM
Citation Isik, SVullo, DDurdagi, SEkinci, DSentürk, MÇetin, ASentürk, ESupuran, CT Interaction of carbonic anhydrase isozymes I, II, and IX with some pyridine and phenol hydrazinecarbothioamide derivatives. Bioorg Med Chem Lett25:5636-41 (2015) 
 
Carbonic anhydrase 1
Name:Carbonic anhydrase 1
Type:Enzyme
Mol. Mass.:28873.37
Organism:Homo sapiens (Human)
Description:P00915
Residue:261
BDBM50133787
NameBDBM50133787
Synonyms:CHEMBL1442294
TypeSmall organic molecule
Emp. Form.C9H12N4OS
Mol. Mass.224.283
SMILESCCN=C(S)NNC(=O)c1ccncc1