Reaction Details
TargetCarbonic anhydrase 9
LigandBDBM50133803
Substrate/Competitorn/a
Meas. Tech.ChEMBL_1526507 (CHEMBL3635395)
Ki 760±n/a nM
Citation Isik, SVullo, DDurdagi, SEkinci, DSentürk, MÇetin, ASentürk, ESupuran, CT Interaction of carbonic anhydrase isozymes I, II, and IX with some pyridine and phenol hydrazinecarbothioamide derivatives. Bioorg Med Chem Lett25:5636-41 (2015) 
 
Carbonic anhydrase 9
Name:Carbonic anhydrase 9
Type:Enzyme
Mol. Mass.:49669.03
Organism:Homo sapiens (Human)
Description:Catalytic domain of human cloned isozyme was used in the assay
Residue:459
BDBM50133803
NameBDBM50133803
Synonyms:CHEMBL3633783
TypeSmall organic molecule
Emp. Form.C11H13N3O2S
Mol. Mass.251.305
SMILESOc1ccccc1C(=O)NNC(=S)NCC=C