Reaction Details
TargetCarbonic anhydrase 9
LigandBDBM50133861
Substrate/Competitorn/a
Meas. Tech.ChEMBL_1526507 (CHEMBL3635395)
Ki 970±n/a nM
Citation Isik, SVullo, DDurdagi, SEkinci, DSentürk, MÇetin, ASentürk, ESupuran, CT Interaction of carbonic anhydrase isozymes I, II, and IX with some pyridine and phenol hydrazinecarbothioamide derivatives. Bioorg Med Chem Lett25:5636-41 (2015) 
 
Carbonic anhydrase 9
Name:Carbonic anhydrase 9
Type:Enzyme
Mol. Mass.:49669.03
Organism:Homo sapiens (Human)
Description:Catalytic domain of human cloned isozyme was used in the assay
Residue:459
BDBM50133861
NameBDBM50133861
Synonyms:CHEMBL1479002
TypeSmall organic molecule
Emp. Form.C10H12N4OS
Mol. Mass.236.293
SMILESC=CCNC(=S)NNC(=O)c1ccncc1