Reaction Details
TargetOrexin receptor type 2
LigandBDBM123331
Substrate/Competitorn/a
Meas. Tech.ChEMBL_1526538 (CHEMBL3635614)
Ki 168±n/a nM
Citation Behnke, DCotesta, SHintermann, SFendt, MGee, CEJacobson, LHLaue, GMeyer, AWagner, TBadiger, SChaudhari, VChebrolu, MPandit, CHoyer, DBetschart, C Discovery of 1H-pyrazolo[3,4-b]pyridines as potent dual orexin receptor antagonists (DORAs). Bioorg Med Chem Lett25:5555-60 (2015) 
 
Orexin receptor type 2
Name:Orexin receptor type 2
Type:Protein
Mol. Mass.:50710.53
Organism:Homo sapiens (Human)
Description:O43614
Residue:444
BDBM123331
NameBDBM123331
Synonyms:US8742106, 1.18
TypeSmall organic molecule
Emp. Form.C24H21F3N4O2
Mol. Mass.454.4443
SMILESCC(NC(=O)COc1cc(c2c(nn(C)c2n1)-c1ccccc1)C(F)(F)F)c1ccccc1